{"text_format":"1","workbook":"xlsx","n_sheets":2,"sheets":["Menù","Ordini"],"not_rendered":{"charts":0,"images":0,"macros":1,"external_links":0,"defined_names":2,"comments":0,"pivot_tables":0},"unopened":[],"bounds":{"document_bytes":16777216,"sheet_cells":100000,"rows_first":2000,"rows_last":500,"rows_between":2000,"halvings":0,"cell_chars":16384,"cell_head_chars":4096},"cells_cut":0,"cells_raw":0,"read":"whole","date_system":"1900"}

{"sheet":"Menù","index":0,"n_rows":36,"n_cols":3,"rows_kept":36,"cut":false,"hidden":false,"merged":[]}
["NOME","PREZZO","TIPOLOGIA"]
["Antipasto misto Terra",10,"Antipasto"]
["Antipasto misto mare",12,"Antipasto"]
["Crostini",8,"Antipasto"]
["spaghetti allo scoglio",12,"Primo"]
["Spaghetti all'arrabbiata",8,"Primo"]
["spaghetti al pesto",9,"Primo"]
["Risotto alla pescatora",13,"Primo"]
["Risotto ai porcini",12,"Primo"]
["Braciola di maiale",10,"Secondo"]
["Bistecca di manzo",12,"Secondo"]
["Bistecca di cavallo",12,"Secondo"]
["Fritto misto",14,"Secondo"]
["Grigliata mista",14,"Secondo"]
["Patate fritte",4,"Contorno"]
["patate al forno",5,"Contorno"]
["Verdure grigliate",3,"Contorno"]
["Insalata mista",2,"Contorno"]
["Torta della nonna",4.5,"Dolce"]
["Torta al cioccolato",4.5,"Dolce"]
["Tiramisù",4.5,"Dolce"]
["Crostata",4.5,"Dolce"]
["Caffè",1.2,"Bar"]
["Amaro erbe",4.5,"Bar"]
["Grappa",4.5,"Bar"]
["Digestivo",3,"Bar"]
["Bibite in lattina",3,"Bar"]
["Bibite in bottiglia",3.5,"Bar"]
["Birra 33 cl",4,"Bar"]
["Birra 66 cl",4.8,"Bar"]
["Birra alla Spina 0,20",4,"Bar"]
["Birra alla Spina 0,40",5,"Bar"]
["Acqua Naturale 1L.",2,"Bar"]
["Acqua Frizzante 1L.",2.2000000000000002,"Bar"]
["Acqua Naturale 1/2 L.",1.2,"Bar"]
["Acqua Frizzante 1/2 L.",1.3,"Bar"]

{"sheet":"Ordini","index":1,"n_rows":1004,"n_cols":6,"rows_kept":1004,"cut":false,"hidden":false,"merged":[[1003,1,1003,3],[1001,1,1001,3],[1002,2,1002,3],[2,2,3,3],[2,1,3,1]]}
["Incasso odierno",{"$f":"SUM(E4:E1000)","v":282.8}]
[]
[null,"Tavolo N°",{"$f":"IF(SUBTOTAL(4,$A$6:$A$1000)<>SUBTOTAL(5,$A$1:$A$1000),\"Tutti\",$A$1002)","v":"Tutti"}]
[]
["N° TAVOLO","ORDINE","Q.TA'","PREZZO SINGOLO","PREZZO TOTALE"]
[1,"Spaghetti all'arrabbiata",1,{"$f":"IF(B6=\"\",\"\",VLOOKUP(B6,Menù!$A$2:$C$1000,2,FALSE))","v":8},{"$f":"IF(B6=\"\",\"\",IF(C6=\"\",\"Scrivi la Quantità\",C6*D6))","v":8},{"$f":"IF(B6=\"\",\"\",IF(A6=\"\",\"Manca il tavolo!!!\",\"\"))","v":""}]
[2,"Birra 66 cl",2,{"$f":"IF(B7=\"\",\"\",VLOOKUP(B7,Menù!$A$2:$C$1000,2,FALSE))","v":4.8},{"$f":"IF(B7=\"\",\"\",IF(C7=\"\",\"Scrivi la Quantità\",C7*D7))","v":9.6},{"$f":"IF(B7=\"\",\"\",IF(A7=\"\",\"Manca il tavolo!!!\",\"\"))","v":""}]
[1,"spaghetti allo scoglio",2,{"$f":"IF(B8=\"\",\"\",VLOOKUP(B8,Menù!$A$2:$C$1000,2,FALSE))","v":12},24,{"$f":"IF(B8=\"\",\"\",IF(A8=\"\",\"Manca il tavolo!!!\",\"\"))","v":""}]
[22,"Antipasto misto Terra",2,{"$f":"IF(B9=\"\",\"\",VLOOKUP(B9,Menù!$A$2:$C$1000,2,FALSE))","v":10},20,""]
[21,"Antipasto misto mare",3,{"$f":"IF(B10=\"\",\"\",VLOOKUP(B10,Menù!$A$2:$C$1000,2,FALSE))","v":12},36,""]
[22,"Crostini",4,{"$f":"IF(B11=\"\",\"\",VLOOKUP(B11,Menù!$A$2:$C$1000,2,FALSE))","v":8},32,""]
[22,"Spaghetti all'arrabbiata",1,{"$f":"IF(B12=\"\",\"\",VLOOKUP(B12,Menù!$A$2:$C$1000,2,FALSE))","v":8},8,""]
[22,"spaghetti al pesto",1,{"$f":"IF(B13=\"\",\"\",VLOOKUP(B13,Menù!$A$2:$C$1000,2,FALSE))","v":9},9,""]
[22,"Fritto misto",2,{"$f":"IF(B14=\"\",\"\",VLOOKUP(B14,Menù!$A$2:$C$1000,2,FALSE))","v":14},28,""]
[22,"Tiramisù",2,{"$f":"IF(B15=\"\",\"\",VLOOKUP(B15,Menù!$A$2:$C$1000,2,FALSE))","v":4.5},9,""]
[22,"Birra 66 cl",1,{"$f":"IF(B16=\"\",\"\",VLOOKUP(B16,Menù!$A$2:$C$1000,2,FALSE))","v":4.8},4.8,""]
[22,"Acqua Naturale 1L.",1,{"$f":"IF(B17=\"\",\"\",VLOOKUP(B17,Menù!$A$2:$C$1000,2,FALSE))","v":2},2,""]
[22,"Caffè",2,{"$f":"IF(B18=\"\",\"\",VLOOKUP(B18,Menù!$A$2:$C$1000,2,FALSE))","v":1.2},2.4,""]
[21,"spaghetti allo scoglio",2,{"$f":"IF(B19=\"\",\"\",VLOOKUP(B19,Menù!$A$2:$C$1000,2,FALSE))","v":12},24,""]
[21,"Risotto ai porcini",1,{"$f":"IF(B20=\"\",\"\",VLOOKUP(B20,Menù!$A$2:$C$1000,2,FALSE))","v":12},12,""]
[21,"Bistecca di manzo",3,{"$f":"IF(B21=\"\",\"\",VLOOKUP(B21,Menù!$A$2:$C$1000,2,FALSE))","v":12},36,""]
[21,"Birra 66 cl",3,{"$f":"IF(B22=\"\",\"\",VLOOKUP(B22,Menù!$A$2:$C$1000,2,FALSE))","v":4.8},14.399999999999999,""]
[21,"Caffè",3,{"$f":"IF(B23=\"\",\"\",VLOOKUP(B23,Menù!$A$2:$C$1000,2,FALSE))","v":1.2},3.5999999999999996,""]
[null,null,null,{"$f":"IF(B24=\"\",\"\",VLOOKUP(B24,Menù!$A$2:$C$1000,2,FALSE))","v":""},"",""]
[null,null,null,{"$f":"IF(B25=\"\",\"\",VLOOKUP(B25,Menù!$A$2:$C$1000,2,FALSE))","v":""},"",""]
[null,null,null,{"$f":"IF(B26=\"\",\"\",VLOOKUP(B26,Menù!$A$2:$C$1000,2,FALSE))","v":""},"",""]
[null,null,null,{"$f":"IF(B27=\"\",\"\",VLOOKUP(B27,Menù!$A$2:$C$1000,2,FALSE))","v":""},"",""]
[null,null,null,{"$f":"IF(B28=\"\",\"\",VLOOKUP(B28,Menù!$A$2:$C$1000,2,FALSE))","v":""},"",""]
[null,null,null,{"$f":"IF(B29=\"\",\"\",VLOOKUP(B29,Menù!$A$2:$C$1000,2,FALSE))","v":""},"",""]
[null,null,null,{"$f":"IF(B30=\"\",\"\",VLOOKUP(B30,Menù!$A$2:$C$1000,2,FALSE))","v":""},"",""]
[null,null,null,{"$f":"IF(B31=\"\",\"\",VLOOKUP(B31,Menù!$A$2:$C$1000,2,FALSE))","v":""},"",""]
[null,null,null,{"$f":"IF(B32=\"\",\"\",VLOOKUP(B32,Menù!$A$2:$C$1000,2,FALSE))","v":""},"",""]
[null,null,null,{"$f":"IF(B33=\"\",\"\",VLOOKUP(B33,Menù!$A$2:$C$1000,2,FALSE))","v":""},"",""]
[null,null,null,{"$f":"IF(B34=\"\",\"\",VLOOKUP(B34,Menù!$A$2:$C$1000,2,FALSE))","v":""},"",""]
[null,null,null,{"$f":"IF(B35=\"\",\"\",VLOOKUP(B35,Menù!$A$2:$C$1000,2,FALSE))","v":""},"",""]
[null,null,null,{"$f":"IF(B36=\"\",\"\",VLOOKUP(B36,Menù!$A$2:$C$1000,2,FALSE))","v":""},"",""]
[null,null,null,{"$f":"IF(B37=\"\",\"\",VLOOKUP(B37,Menù!$A$2:$C$1000,2,FALSE))","v":""},"",""]
[null,null,null,{"$f":"IF(B38=\"\",\"\",VLOOKUP(B38,Menù!$A$2:$C$1000,2,FALSE))","v":""},"",""]
[null,null,null,{"$f":"IF(B39=\"\",\"\",VLOOKUP(B39,Menù!$A$2:$C$1000,2,FALSE))","v":""},"",""]
[null,null,null,{"$f":"IF(B40=\"\",\"\",VLOOKUP(B40,Menù!$A$2:$C$1000,2,FALSE))","v":""},"",""]
[null,null,null,{"$f":"IF(B41=\"\",\"\",VLOOKUP(B41,Menù!$A$2:$C$1000,2,FALSE))","v":""},"",""]
[null,null,null,{"$f":"IF(B42=\"\",\"\",VLOOKUP(B42,Menù!$A$2:$C$1000,2,FALSE))","v":""},"",""]
[null,null,null,{"$f":"IF(B43=\"\",\"\",VLOOKUP(B43,Menù!$A$2:$C$1000,2,FALSE))","v":""},"",""]
[null,null,null,{"$f":"IF(B44=\"\",\"\",VLOOKUP(B44,Menù!$A$2:$C$1000,2,FALSE))","v":""},"",""]
[null,null,null,{"$f":"IF(B45=\"\",\"\",VLOOKUP(B45,Menù!$A$2:$C$1000,2,FALSE))","v":""},"",""]
[null,null,null,{"$f":"IF(B46=\"\",\"\",VLOOKUP(B46,Menù!$A$2:$C$1000,2,FALSE))","v":""},"",""]
[null,null,null,{"$f":"IF(B47=\"\",\"\",VLOOKUP(B47,Menù!$A$2:$C$1000,2,FALSE))","v":""},"",""]
[null,null,null,{"$f":"IF(B48=\"\",\"\",VLOOKUP(B48,Menù!$A$2:$C$1000,2,FALSE))","v":""},"",""]
[null,null,null,{"$f":"IF(B49=\"\",\"\",VLOOKUP(B49,Menù!$A$2:$C$1000,2,FALSE))","v":""},"",""]
[null,null,null,{"$f":"IF(B50=\"\",\"\",VLOOKUP(B50,Menù!$A$2:$C$1000,2,FALSE))","v":""},"",""]
[null,null,null,{"$f":"IF(B51=\"\",\"\",VLOOKUP(B51,Menù!$A$2:$C$1000,2,FALSE))","v":""},"",""]
[null,null,null,{"$f":"IF(B52=\"\",\"\",VLOOKUP(B52,Menù!$A$2:$C$1000,2,FALSE))","v":""},"",""]
[null,null,null,{"$f":"IF(B53=\"\",\"\",VLOOKUP(B53,Menù!$A$2:$C$1000,2,FALSE))","v":""},"",""]
[null,null,null,{"$f":"IF(B54=\"\",\"\",VLOOKUP(B54,Menù!$A$2:$C$1000,2,FALSE))","v":""},"",""]
[null,null,null,{"$f":"IF(B55=\"\",\"\",VLOOKUP(B55,Menù!$A$2:$C$1000,2,FALSE))","v":""},"",""]
[null,null,null,{"$f":"IF(B56=\"\",\"\",VLOOKUP(B56,Menù!$A$2:$C$1000,2,FALSE))","v":""},"",""]
[null,null,null,{"$f":"IF(B57=\"\",\"\",VLOOKUP(B57,Menù!$A$2:$C$1000,2,FALSE))","v":""},"",""]
[null,null,null,{"$f":"IF(B58=\"\",\"\",VLOOKUP(B58,Menù!$A$2:$C$1000,2,FALSE))","v":""},"",""]
[null,null,null,{"$f":"IF(B59=\"\",\"\",VLOOKUP(B59,Menù!$A$2:$C$1000,2,FALSE))","v":""},"",""]
[null,null,null,{"$f":"IF(B60=\"\",\"\",VLOOKUP(B60,Menù!$A$2:$C$1000,2,FALSE))","v":""},"",""]
[null,null,null,{"$f":"IF(B61=\"\",\"\",VLOOKUP(B61,Menù!$A$2:$C$1000,2,FALSE))","v":""},"",""]
[null,null,null,{"$f":"IF(B62=\"\",\"\",VLOOKUP(B62,Menù!$A$2:$C$1000,2,FALSE))","v":""},"",""]
[null,null,null,{"$f":"IF(B63=\"\",\"\",VLOOKUP(B63,Menù!$A$2:$C$1000,2,FALSE))","v":""},"",""]
[null,null,null,{"$f":"IF(B64=\"\",\"\",VLOOKUP(B64,Menù!$A$2:$C$1000,2,FALSE))","v":""},"",""]
[null,null,null,{"$f":"IF(B65=\"\",\"\",VLOOKUP(B65,Menù!$A$2:$C$1000,2,FALSE))","v":""},"",""]
[null,null,null,{"$f":"IF(B66=\"\",\"\",VLOOKUP(B66,Menù!$A$2:$C$1000,2,FALSE))","v":""},"",""]
[null,null,null,{"$f":"IF(B67=\"\",\"\",VLOOKUP(B67,Menù!$A$2:$C$1000,2,FALSE))","v":""},"",""]
[null,null,null,{"$f":"IF(B68=\"\",\"\",VLOOKUP(B68,Menù!$A$2:$C$1000,2,FALSE))","v":""},"",""]
[null,null,null,{"$f":"IF(B69=\"\",\"\",VLOOKUP(B69,Menù!$A$2:$C$1000,2,FALSE))","v":""},"",""]
[null,null,null,{"$f":"IF(B70=\"\",\"\",VLOOKUP(B70,Menù!$A$2:$C$1000,2,FALSE))","v":""},"",""]
[null,null,null,{"$f":"IF(B71=\"\",\"\",VLOOKUP(B71,Menù!$A$2:$C$1000,2,FALSE))","v":""},{"$f":"IF(B71=\"\",\"\",IF(C71=\"\",\"Scrivi la Quantità\",C71*D71))","v":""},{"$f":"IF(B71=\"\",\"\",IF(A71=\"\",\"Manca il tavolo!!!\",\"\"))","v":""}]
[null,null,null,{"$f":"IF(B72=\"\",\"\",VLOOKUP(B72,Menù!$A$2:$C$1000,2,FALSE))","v":""},"",""]
[null,null,null,{"$f":"IF(B73=\"\",\"\",VLOOKUP(B73,Menù!$A$2:$C$1000,2,FALSE))","v":""},"",""]
[null,null,null,{"$f":"IF(B74=\"\",\"\",VLOOKUP(B74,Menù!$A$2:$C$1000,2,FALSE))","v":""},"",""]
[null,null,null,{"$f":"IF(B75=\"\",\"\",VLOOKUP(B75,Menù!$A$2:$C$1000,2,FALSE))","v":""},"",""]
[null,null,null,{"$f":"IF(B76=\"\",\"\",VLOOKUP(B76,Menù!$A$2:$C$1000,2,FALSE))","v":""},"",""]
[null,null,null,{"$f":"IF(B77=\"\",\"\",VLOOKUP(B77,Menù!$A$2:$C$1000,2,FALSE))","v":""},"",""]
[null,null,null,{"$f":"IF(B78=\"\",\"\",VLOOKUP(B78,Menù!$A$2:$C$1000,2,FALSE))","v":""},"",""]
[null,null,null,{"$f":"IF(B79=\"\",\"\",VLOOKUP(B79,Menù!$A$2:$C$1000,2,FALSE))","v":""},"",""]
[null,null,null,{"$f":"IF(B80=\"\",\"\",VLOOKUP(B80,Menù!$A$2:$C$1000,2,FALSE))","v":""},"",""]
[null,null,null,{"$f":"IF(B81=\"\",\"\",VLOOKUP(B81,Menù!$A$2:$C$1000,2,FALSE))","v":""},"",""]
[null,null,null,{"$f":"IF(B82=\"\",\"\",VLOOKUP(B82,Menù!$A$2:$C$1000,2,FALSE))","v":""},"",""]
[null,null,null,{"$f":"IF(B83=\"\",\"\",VLOOKUP(B83,Menù!$A$2:$C$1000,2,FALSE))","v":""},"",""]
[null,null,null,{"$f":"IF(B84=\"\",\"\",VLOOKUP(B84,Menù!$A$2:$C$1000,2,FALSE))","v":""},"",""]
[null,null,null,{"$f":"IF(B85=\"\",\"\",VLOOKUP(B85,Menù!$A$2:$C$1000,2,FALSE))","v":""},"",""]
[null,null,null,{"$f":"IF(B86=\"\",\"\",VLOOKUP(B86,Menù!$A$2:$C$1000,2,FALSE))","v":""},"",""]
[null,null,null,{"$f":"IF(B87=\"\",\"\",VLOOKUP(B87,Menù!$A$2:$C$1000,2,FALSE))","v":""},"",""]
[null,null,null,{"$f":"IF(B88=\"\",\"\",VLOOKUP(B88,Menù!$A$2:$C$1000,2,FALSE))","v":""},"",""]
[null,null,null,{"$f":"IF(B89=\"\",\"\",VLOOKUP(B89,Menù!$A$2:$C$1000,2,FALSE))","v":""},"",""]
[null,null,null,{"$f":"IF(B90=\"\",\"\",VLOOKUP(B90,Menù!$A$2:$C$1000,2,FALSE))","v":""},"",""]
[null,null,null,{"$f":"IF(B91=\"\",\"\",VLOOKUP(B91,Menù!$A$2:$C$1000,2,FALSE))","v":""},"",""]
[null,null,null,{"$f":"IF(B92=\"\",\"\",VLOOKUP(B92,Menù!$A$2:$C$1000,2,FALSE))","v":""},"",""]
[null,null,null,{"$f":"IF(B93=\"\",\"\",VLOOKUP(B93,Menù!$A$2:$C$1000,2,FALSE))","v":""},"",""]
[null,null,null,{"$f":"IF(B94=\"\",\"\",VLOOKUP(B94,Menù!$A$2:$C$1000,2,FALSE))","v":""},"",""]
[null,null,null,{"$f":"IF(B95=\"\",\"\",VLOOKUP(B95,Menù!$A$2:$C$1000,2,FALSE))","v":""},"",""]
[null,null,null,{"$f":"IF(B96=\"\",\"\",VLOOKUP(B96,Menù!$A$2:$C$1000,2,FALSE))","v":""},"",""]
[null,null,null,{"$f":"IF(B97=\"\",\"\",VLOOKUP(B97,Menù!$A$2:$C$1000,2,FALSE))","v":""},"",""]
[null,null,null,{"$f":"IF(B98=\"\",\"\",VLOOKUP(B98,Menù!$A$2:$C$1000,2,FALSE))","v":""},"",""]
[null,null,null,{"$f":"IF(B99=\"\",\"\",VLOOKUP(B99,Menù!$A$2:$C$1000,2,FALSE))","v":""},"",""]
[null,null,null,{"$f":"IF(B100=\"\",\"\",VLOOKUP(B100,Menù!$A$2:$C$1000,2,FALSE))","v":""},"",""]
[null,null,null,{"$f":"IF(B101=\"\",\"\",VLOOKUP(B101,Menù!$A$2:$C$1000,2,FALSE))","v":""},"",""]
[null,null,null,{"$f":"IF(B102=\"\",\"\",VLOOKUP(B102,Menù!$A$2:$C$1000,2,FALSE))","v":""},"",""]
[null,null,null,{"$f":"IF(B103=\"\",\"\",VLOOKUP(B103,Menù!$A$2:$C$1000,2,FALSE))","v":""},"",""]
[null,null,null,{"$f":"IF(B104=\"\",\"\",VLOOKUP(B104,Menù!$A$2:$C$1000,2,FALSE))","v":""},"",""]
[null,null,null,{"$f":"IF(B105=\"\",\"\",VLOOKUP(B105,Menù!$A$2:$C$1000,2,FALSE))","v":""},"",""]
[null,null,null,{"$f":"IF(B106=\"\",\"\",VLOOKUP(B106,Menù!$A$2:$C$1000,2,FALSE))","v":""},"",""]
[null,null,null,{"$f":"IF(B107=\"\",\"\",VLOOKUP(B107,Menù!$A$2:$C$1000,2,FALSE))","v":""},"",""]
[null,null,null,{"$f":"IF(B108=\"\",\"\",VLOOKUP(B108,Menù!$A$2:$C$1000,2,FALSE))","v":""},"",""]
[null,null,null,{"$f":"IF(B109=\"\",\"\",VLOOKUP(B109,Menù!$A$2:$C$1000,2,FALSE))","v":""},"",""]
[null,null,null,{"$f":"IF(B110=\"\",\"\",VLOOKUP(B110,Menù!$A$2:$C$1000,2,FALSE))","v":""},"",""]
[null,null,null,{"$f":"IF(B111=\"\",\"\",VLOOKUP(B111,Menù!$A$2:$C$1000,2,FALSE))","v":""},"",""]
[null,null,null,{"$f":"IF(B112=\"\",\"\",VLOOKUP(B112,Menù!$A$2:$C$1000,2,FALSE))","v":""},"",""]
[null,null,null,{"$f":"IF(B113=\"\",\"\",VLOOKUP(B113,Menù!$A$2:$C$1000,2,FALSE))","v":""},"",""]
[null,null,null,{"$f":"IF(B114=\"\",\"\",VLOOKUP(B114,Menù!$A$2:$C$1000,2,FALSE))","v":""},"",""]
[null,null,null,{"$f":"IF(B115=\"\",\"\",VLOOKUP(B115,Menù!$A$2:$C$1000,2,FALSE))","v":""},"",""]
[null,null,null,{"$f":"IF(B116=\"\",\"\",VLOOKUP(B116,Menù!$A$2:$C$1000,2,FALSE))","v":""},"",""]
[null,null,null,{"$f":"IF(B117=\"\",\"\",VLOOKUP(B117,Menù!$A$2:$C$1000,2,FALSE))","v":""},"",""]
[null,null,null,{"$f":"IF(B118=\"\",\"\",VLOOKUP(B118,Menù!$A$2:$C$1000,2,FALSE))","v":""},"",""]
[null,null,null,{"$f":"IF(B119=\"\",\"\",VLOOKUP(B119,Menù!$A$2:$C$1000,2,FALSE))","v":""},"",""]
[null,null,null,{"$f":"IF(B120=\"\",\"\",VLOOKUP(B120,Menù!$A$2:$C$1000,2,FALSE))","v":""},"",""]
[null,null,null,{"$f":"IF(B121=\"\",\"\",VLOOKUP(B121,Menù!$A$2:$C$1000,2,FALSE))","v":""},"",""]
[null,null,null,{"$f":"IF(B122=\"\",\"\",VLOOKUP(B122,Menù!$A$2:$C$1000,2,FALSE))","v":""},"",""]
[null,null,null,{"$f":"IF(B123=\"\",\"\",VLOOKUP(B123,Menù!$A$2:$C$1000,2,FALSE))","v":""},"",""]
[null,null,null,{"$f":"IF(B124=\"\",\"\",VLOOKUP(B124,Menù!$A$2:$C$1000,2,FALSE))","v":""},"",""]
[null,null,null,{"$f":"IF(B125=\"\",\"\",VLOOKUP(B125,Menù!$A$2:$C$1000,2,FALSE))","v":""},"",""]
[null,null,null,{"$f":"IF(B126=\"\",\"\",VLOOKUP(B126,Menù!$A$2:$C$1000,2,FALSE))","v":""},"",""]
[null,null,null,{"$f":"IF(B127=\"\",\"\",VLOOKUP(B127,Menù!$A$2:$C$1000,2,FALSE))","v":""},"",""]
[null,null,null,{"$f":"IF(B128=\"\",\"\",VLOOKUP(B128,Menù!$A$2:$C$1000,2,FALSE))","v":""},"",""]
[null,null,null,{"$f":"IF(B129=\"\",\"\",VLOOKUP(B129,Menù!$A$2:$C$1000,2,FALSE))","v":""},"",""]
[null,null,null,{"$f":"IF(B130=\"\",\"\",VLOOKUP(B130,Menù!$A$2:$C$1000,2,FALSE))","v":""},"",""]
[null,null,null,{"$f":"IF(B131=\"\",\"\",VLOOKUP(B131,Menù!$A$2:$C$1000,2,FALSE))","v":""},"",""]
[null,null,null,{"$f":"IF(B132=\"\",\"\",VLOOKUP(B132,Menù!$A$2:$C$1000,2,FALSE))","v":""},"",""]
[null,null,null,{"$f":"IF(B133=\"\",\"\",VLOOKUP(B133,Menù!$A$2:$C$1000,2,FALSE))","v":""},"",""]
[null,null,null,{"$f":"IF(B134=\"\",\"\",VLOOKUP(B134,Menù!$A$2:$C$1000,2,FALSE))","v":""},"",""]
[null,null,null,{"$f":"IF(B135=\"\",\"\",VLOOKUP(B135,Menù!$A$2:$C$1000,2,FALSE))","v":""},{"$f":"IF(B135=\"\",\"\",IF(C135=\"\",\"Scrivi la Quantità\",C135*D135))","v":""},{"$f":"IF(B135=\"\",\"\",IF(A135=\"\",\"Manca il tavolo!!!\",\"\"))","v":""}]
[null,null,null,{"$f":"IF(B136=\"\",\"\",VLOOKUP(B136,Menù!$A$2:$C$1000,2,FALSE))","v":""},"",""]
[null,null,null,{"$f":"IF(B137=\"\",\"\",VLOOKUP(B137,Menù!$A$2:$C$1000,2,FALSE))","v":""},"",""]
[null,null,null,{"$f":"IF(B138=\"\",\"\",VLOOKUP(B138,Menù!$A$2:$C$1000,2,FALSE))","v":""},"",""]
[null,null,null,{"$f":"IF(B139=\"\",\"\",VLOOKUP(B139,Menù!$A$2:$C$1000,2,FALSE))","v":""},"",""]
[null,null,null,{"$f":"IF(B140=\"\",\"\",VLOOKUP(B140,Menù!$A$2:$C$1000,2,FALSE))","v":""},"",""]
[null,null,null,{"$f":"IF(B141=\"\",\"\",VLOOKUP(B141,Menù!$A$2:$C$1000,2,FALSE))","v":""},"",""]
[null,null,null,{"$f":"IF(B142=\"\",\"\",VLOOKUP(B142,Menù!$A$2:$C$1000,2,FALSE))","v":""},"",""]
[null,null,null,{"$f":"IF(B143=\"\",\"\",VLOOKUP(B143,Menù!$A$2:$C$1000,2,FALSE))","v":""},"",""]
[null,null,null,{"$f":"IF(B144=\"\",\"\",VLOOKUP(B144,Menù!$A$2:$C$1000,2,FALSE))","v":""},"",""]
[null,null,null,{"$f":"IF(B145=\"\",\"\",VLOOKUP(B145,Menù!$A$2:$C$1000,2,FALSE))","v":""},"",""]
[null,null,null,{"$f":"IF(B146=\"\",\"\",VLOOKUP(B146,Menù!$A$2:$C$1000,2,FALSE))","v":""},"",""]
[null,null,null,{"$f":"IF(B147=\"\",\"\",VLOOKUP(B147,Menù!$A$2:$C$1000,2,FALSE))","v":""},"",""]
[null,null,null,{"$f":"IF(B148=\"\",\"\",VLOOKUP(B148,Menù!$A$2:$C$1000,2,FALSE))","v":""},"",""]
[null,null,null,{"$f":"IF(B149=\"\",\"\",VLOOKUP(B149,Menù!$A$2:$C$1000,2,FALSE))","v":""},"",""]
[null,null,null,{"$f":"IF(B150=\"\",\"\",VLOOKUP(B150,Menù!$A$2:$C$1000,2,FALSE))","v":""},"",""]
[null,null,null,{"$f":"IF(B151=\"\",\"\",VLOOKUP(B151,Menù!$A$2:$C$1000,2,FALSE))","v":""},"",""]
[null,null,null,{"$f":"IF(B152=\"\",\"\",VLOOKUP(B152,Menù!$A$2:$C$1000,2,FALSE))","v":""},"",""]
[null,null,null,{"$f":"IF(B153=\"\",\"\",VLOOKUP(B153,Menù!$A$2:$C$1000,2,FALSE))","v":""},"",""]
[null,null,null,{"$f":"IF(B154=\"\",\"\",VLOOKUP(B154,Menù!$A$2:$C$1000,2,FALSE))","v":""},"",""]
[null,null,null,{"$f":"IF(B155=\"\",\"\",VLOOKUP(B155,Menù!$A$2:$C$1000,2,FALSE))","v":""},"",""]
[null,null,null,{"$f":"IF(B156=\"\",\"\",VLOOKUP(B156,Menù!$A$2:$C$1000,2,FALSE))","v":""},"",""]
[null,null,null,{"$f":"IF(B157=\"\",\"\",VLOOKUP(B157,Menù!$A$2:$C$1000,2,FALSE))","v":""},"",""]
[null,null,null,{"$f":"IF(B158=\"\",\"\",VLOOKUP(B158,Menù!$A$2:$C$1000,2,FALSE))","v":""},"",""]
[null,null,null,{"$f":"IF(B159=\"\",\"\",VLOOKUP(B159,Menù!$A$2:$C$1000,2,FALSE))","v":""},"",""]
[null,null,null,{"$f":"IF(B160=\"\",\"\",VLOOKUP(B160,Menù!$A$2:$C$1000,2,FALSE))","v":""},"",""]
[null,null,null,{"$f":"IF(B161=\"\",\"\",VLOOKUP(B161,Menù!$A$2:$C$1000,2,FALSE))","v":""},"",""]
[null,null,null,{"$f":"IF(B162=\"\",\"\",VLOOKUP(B162,Menù!$A$2:$C$1000,2,FALSE))","v":""},"",""]
[null,null,null,{"$f":"IF(B163=\"\",\"\",VLOOKUP(B163,Menù!$A$2:$C$1000,2,FALSE))","v":""},"",""]
[null,null,null,{"$f":"IF(B164=\"\",\"\",VLOOKUP(B164,Menù!$A$2:$C$1000,2,FALSE))","v":""},"",""]
[null,null,null,{"$f":"IF(B165=\"\",\"\",VLOOKUP(B165,Menù!$A$2:$C$1000,2,FALSE))","v":""},"",""]
[null,null,null,{"$f":"IF(B166=\"\",\"\",VLOOKUP(B166,Menù!$A$2:$C$1000,2,FALSE))","v":""},"",""]
[null,null,null,{"$f":"IF(B167=\"\",\"\",VLOOKUP(B167,Menù!$A$2:$C$1000,2,FALSE))","v":""},"",""]
[null,null,null,{"$f":"IF(B168=\"\",\"\",VLOOKUP(B168,Menù!$A$2:$C$1000,2,FALSE))","v":""},"",""]
[null,null,null,{"$f":"IF(B169=\"\",\"\",VLOOKUP(B169,Menù!$A$2:$C$1000,2,FALSE))","v":""},"",""]
[null,null,null,{"$f":"IF(B170=\"\",\"\",VLOOKUP(B170,Menù!$A$2:$C$1000,2,FALSE))","v":""},"",""]
[null,null,null,{"$f":"IF(B171=\"\",\"\",VLOOKUP(B171,Menù!$A$2:$C$1000,2,FALSE))","v":""},"",""]
[null,null,null,{"$f":"IF(B172=\"\",\"\",VLOOKUP(B172,Menù!$A$2:$C$1000,2,FALSE))","v":""},"",""]
[null,null,null,{"$f":"IF(B173=\"\",\"\",VLOOKUP(B173,Menù!$A$2:$C$1000,2,FALSE))","v":""},"",""]
[null,null,null,{"$f":"IF(B174=\"\",\"\",VLOOKUP(B174,Menù!$A$2:$C$1000,2,FALSE))","v":""},"",""]
[null,null,null,{"$f":"IF(B175=\"\",\"\",VLOOKUP(B175,Menù!$A$2:$C$1000,2,FALSE))","v":""},"",""]
[null,null,null,{"$f":"IF(B176=\"\",\"\",VLOOKUP(B176,Menù!$A$2:$C$1000,2,FALSE))","v":""},"",""]
[null,null,null,{"$f":"IF(B177=\"\",\"\",VLOOKUP(B177,Menù!$A$2:$C$1000,2,FALSE))","v":""},"",""]
[null,null,null,{"$f":"IF(B178=\"\",\"\",VLOOKUP(B178,Menù!$A$2:$C$1000,2,FALSE))","v":""},"",""]
[null,null,null,{"$f":"IF(B179=\"\",\"\",VLOOKUP(B179,Menù!$A$2:$C$1000,2,FALSE))","v":""},"",""]
[null,null,null,{"$f":"IF(B180=\"\",\"\",VLOOKUP(B180,Menù!$A$2:$C$1000,2,FALSE))","v":""},"",""]
[null,null,null,{"$f":"IF(B181=\"\",\"\",VLOOKUP(B181,Menù!$A$2:$C$1000,2,FALSE))","v":""},"",""]
[null,null,null,{"$f":"IF(B182=\"\",\"\",VLOOKUP(B182,Menù!$A$2:$C$1000,2,FALSE))","v":""},"",""]
[null,null,null,{"$f":"IF(B183=\"\",\"\",VLOOKUP(B183,Menù!$A$2:$C$1000,2,FALSE))","v":""},"",""]
[null,null,null,{"$f":"IF(B184=\"\",\"\",VLOOKUP(B184,Menù!$A$2:$C$1000,2,FALSE))","v":""},"",""]
[null,null,null,{"$f":"IF(B185=\"\",\"\",VLOOKUP(B185,Menù!$A$2:$C$1000,2,FALSE))","v":""},"",""]
[null,null,null,{"$f":"IF(B186=\"\",\"\",VLOOKUP(B186,Menù!$A$2:$C$1000,2,FALSE))","v":""},"",""]
[null,null,null,{"$f":"IF(B187=\"\",\"\",VLOOKUP(B187,Menù!$A$2:$C$1000,2,FALSE))","v":""},"",""]
[null,null,null,{"$f":"IF(B188=\"\",\"\",VLOOKUP(B188,Menù!$A$2:$C$1000,2,FALSE))","v":""},"",""]
[null,null,null,{"$f":"IF(B189=\"\",\"\",VLOOKUP(B189,Menù!$A$2:$C$1000,2,FALSE))","v":""},"",""]
[null,null,null,{"$f":"IF(B190=\"\",\"\",VLOOKUP(B190,Menù!$A$2:$C$1000,2,FALSE))","v":""},"",""]
[null,null,null,{"$f":"IF(B191=\"\",\"\",VLOOKUP(B191,Menù!$A$2:$C$1000,2,FALSE))","v":""},"",""]
[null,null,null,{"$f":"IF(B192=\"\",\"\",VLOOKUP(B192,Menù!$A$2:$C$1000,2,FALSE))","v":""},"",""]
[null,null,null,{"$f":"IF(B193=\"\",\"\",VLOOKUP(B193,Menù!$A$2:$C$1000,2,FALSE))","v":""},"",""]
[null,null,null,{"$f":"IF(B194=\"\",\"\",VLOOKUP(B194,Menù!$A$2:$C$1000,2,FALSE))","v":""},"",""]
[null,null,null,{"$f":"IF(B195=\"\",\"\",VLOOKUP(B195,Menù!$A$2:$C$1000,2,FALSE))","v":""},"",""]
[null,null,null,{"$f":"IF(B196=\"\",\"\",VLOOKUP(B196,Menù!$A$2:$C$1000,2,FALSE))","v":""},"",""]
[null,null,null,{"$f":"IF(B197=\"\",\"\",VLOOKUP(B197,Menù!$A$2:$C$1000,2,FALSE))","v":""},"",""]
[null,null,null,{"$f":"IF(B198=\"\",\"\",VLOOKUP(B198,Menù!$A$2:$C$1000,2,FALSE))","v":""},"",""]
[null,null,null,{"$f":"IF(B199=\"\",\"\",VLOOKUP(B199,Menù!$A$2:$C$1000,2,FALSE))","v":""},{"$f":"IF(B199=\"\",\"\",IF(C199=\"\",\"Scrivi la Quantità\",C199*D199))","v":""},{"$f":"IF(B199=\"\",\"\",IF(A199=\"\",\"Manca il tavolo!!!\",\"\"))","v":""}]
[null,null,null,{"$f":"IF(B200=\"\",\"\",VLOOKUP(B200,Menù!$A$2:$C$1000,2,FALSE))","v":""},"",""]
{"$rows_left_out":804}